Reaction Details
TargetMast/stem cell growth factor receptor Kit
LigandBDBM50515229
Substrate/Competitorn/a
Meas. Tech.ChEMBL_1860350 (CHEMBL4361206)
EC50<100±n/a nM
Citation Wu, YWang, BWang, JQi, SZou, FQi, ZLiu, FLiu, QChen, CHu, CHu, ZWang, AWang, LWang, WRen, TCai, YBai, MLiu, QLiu, J Discovery of 2-(4-Chloro-3-(trifluoromethyl)phenyl)- J Med Chem62:6083-6101 (2019) 
 
Mast/stem cell growth factor receptor Kit
Name:Mast/stem cell growth factor receptor Kit
Type:Protein
Mol. Mass.:109869.37
Organism:Homo sapiens (Human)
Description:P10721
Residue:976
BDBM50515229
NameBDBM50515229
Synonyms:CHEMBL4577779
TypeSmall organic molecule
Emp. Form.C26H20ClF3N2O4
Mol. Mass.516.896
SMILESCOc1cc2nccc(Oc3ccc(NC(=O)Cc4ccc(Cl)c(c4)C(F)(F)F)cc3)c2cc1OC