Reaction Details
TargetCorticotropin-releasing factor receptor 1
LigandBDBM50071233
Substrate/Competitorn/a
Meas. Tech.ChEBML_51121
Ki 15±n/a nM
Citation Wustrow, DJCapiris, TRubin, RKnobelsdorf, JAAkunne, HDavis, MDMacKenzie, RPugsley, TAZoski, KTHeffner, TGWise, LD Pyrazolo[1,5-a]pyrimidine CRF-1 receptor antagonists. Bioorg Med Chem Lett8:2067-70 (1999) Corticotropin-releasing factor receptor 1
Name:Corticotropin-releasing factor receptor 1
Type:Enzyme
Mol. Mass.:50744.31
Organism:Homo sapiens (Human)
Description:P34998
Residue:444
BDBM50071233
NameBDBM50071233
Synonyms:Butyl-[3-(2-chloro-phenyl)-2,5-dimethyl-pyrazolo[1,5-a]pyrimidin-7-yl]-ethyl-amine | CHEMBL292764
TypeSmall organic molecule
Emp. Form.C20H25ClN4
Mol. Mass.356.892
SMILESCCCCN(CC)c1cc(C)nc2c(c(C)nn12)-c1ccccc1Cl