Reaction Details
TargetCorticotropin-releasing factor receptor 1
LigandBDBM50071238
Substrate/Competitorn/a
Meas. Tech.ChEBML_51121
Ki 6.4±n/a nM
Citation Wustrow, DJCapiris, TRubin, RKnobelsdorf, JAAkunne, HDavis, MDMacKenzie, RPugsley, TAZoski, KTHeffner, TGWise, LD Pyrazolo[1,5-a]pyrimidine CRF-1 receptor antagonists. Bioorg Med Chem Lett8:2067-70 (1999) Corticotropin-releasing factor receptor 1
Name:Corticotropin-releasing factor receptor 1
Type:Enzyme
Mol. Mass.:50744.31
Organism:Homo sapiens (Human)
Description:P34998
Residue:444
BDBM50071238
NameBDBM50071238
Synonyms:3-(2,4-Dichloro-phenyl)-2,5-dimethyl-7-(2-propyl-piperidin-1-yl)-pyrazolo[1,5-a]pyrimidine | CHEMBL305092
TypeSmall organic molecule
Emp. Form.C22H26Cl2N4
Mol. Mass.417.375
SMILESCCCC1CCCCN1c1cc(C)nc2c(c(C)nn12)-c1ccc(Cl)cc1Cl