Reaction Details
TargetBeta-2 adrenergic receptor
LigandBDBM50071296
Substrate/Competitorn/a
Meas. Tech.ChEBML_38311
IC50 28±n/a nM
Citation Weber, AEOk, HOAlvaro, RFCandelore, MRCascieri, MAChiu, SHDeng, LForrest, MJHom, GJHutchins, JEKao, JMacIntyre, DEMathvink, RJMcLoughlin, DMiller, RRNewbold, RCOlah, TVParmee, ERPerkins, LStearns, RAStrader, CDSzumiloski, JTang, YSTota, LFisher, MH 3-Pyridyloxypropanolamine agonists of the beta 3 adrenergic receptor with improved pharmacokinetic properties. Bioorg Med Chem Lett8:2111-6 (1999) Beta-2 adrenergic receptor
Name:Beta-2 adrenergic receptor
Type:n/a
Mol. Mass.:46461.69
Organism:Homo sapiens (Human)
Description:P07550
Residue:413
BDBM50071296
NameBDBM50071296
Synonyms:CHEMBL64201 | N-(4-{2-[(S)-3-(6-Amino-pyridin-3-yloxy)-2-hydroxy-propylamino]-ethyl}-phenyl)-4-iodo-benzenesulfonamide
TypeSmall organic molecule
Emp. Form.C22H25IN4O4S
Mol. Mass.568.428
SMILESNc1ccc(OC[C@@H](O)CNCCc2ccc(NS(=O)(=O)c3ccc(I)cc3)cc2)cn1