Reaction Details
TargetBeta-1 adrenergic receptor
LigandBDBM50071296
Substrate/Competitorn/a
Meas. Tech.ChEBML_37378
IC50 1000±n/a nM
Citation Weber, AEOk, HOAlvaro, RFCandelore, MRCascieri, MAChiu, SHDeng, LForrest, MJHom, GJHutchins, JEKao, JMacIntyre, DEMathvink, RJMcLoughlin, DMiller, RRNewbold, RCOlah, TVParmee, ERPerkins, LStearns, RAStrader, CDSzumiloski, JTang, YSTota, LFisher, MH 3-Pyridyloxypropanolamine agonists of the beta 3 adrenergic receptor with improved pharmacokinetic properties. Bioorg Med Chem Lett8:2111-6 (1999) Beta-1 adrenergic receptor
Name:Beta-1 adrenergic receptor
Type:G Protein-Coupled Receptor (GPCR)
Mol. Mass.:51338.40
Organism:Homo sapiens (Human)
Description:P08588
Residue:477
BDBM50071296
NameBDBM50071296
Synonyms:CHEMBL64201 | N-(4-{2-[(S)-3-(6-Amino-pyridin-3-yloxy)-2-hydroxy-propylamino]-ethyl}-phenyl)-4-iodo-benzenesulfonamide
TypeSmall organic molecule
Emp. Form.C22H25IN4O4S
Mol. Mass.568.428
SMILESNc1ccc(OC[C@@H](O)CNCCc2ccc(NS(=O)(=O)c3ccc(I)cc3)cc2)cn1