Reaction Details
TargetReverse transcriptase/RNaseH
LigandBDBM50071763
Substrate/Competitorn/a
Meas. Tech.ChEMBL_196364 (CHEMBL805997)
IC50 9000±n/a nM
Citation Milton, JSlater, MJBird, AJSpinks, DScott, GPrice, CEDowning, SGreen, DVMadar, SBethell, RStammers, DK Biaryl acids: novel non-nucleoside inhibitors of HIV reverse transcriptase types 1 and 2. Bioorg Med Chem Lett8:2623-8 (1999) Reverse transcriptase/RNaseH
Name:Reverse transcriptase/RNaseH
Type:PROTEIN
Mol. Mass.:65229.15
Organism:Human immunodeficiency virus 1
Description:ChEMBL_1473730
Residue:566
BDBM50071763
NameBDBM50071763
Synonyms:2-({6-[(2-carboxyphenyl)amino]-6-oxohexanoyl}amino)benzoic acid | CHEMBL315784
TypeSmall organic molecule
Emp. Form.C20H20N2O6
Mol. Mass.384.3826
SMILESOC(=O)c1ccccc1NC(=O)CCCCC(=O)Nc1ccccc1C(O)=O