Reaction Details
TargetReverse transcriptase/RNaseH
LigandBDBM50071778
Substrate/Competitorn/a
Meas. Tech.ChEMBL_197451 (CHEMBL804236)
IC50 12000±n/a nM
Citation Milton, JSlater, MJBird, AJSpinks, DScott, GPrice, CEDowning, SGreen, DVMadar, SBethell, RStammers, DK Biaryl acids: novel non-nucleoside inhibitors of HIV reverse transcriptase types 1 and 2. Bioorg Med Chem Lett8:2623-8 (1999) Reverse transcriptase/RNaseH
Name:Reverse transcriptase/RNaseH
Type:PROTEIN
Mol. Mass.:65229.15
Organism:Human immunodeficiency virus 1
Description:ChEMBL_1473730
Residue:566
BDBM50071778
NameBDBM50071778
Synonyms:2-[4-(2-carboxy-4-trifluoromethylphenylcarbamoyl)butylcarboxamido]-5-trifluoromethylbenzoic acid | CHEMBL89674
TypeSmall organic molecule
Emp. Form.C22H18F6N2O6
Mol. Mass.520.3785
SMILESOC(=O)c1cc(ccc1NC(=O)CCCCC(=O)Nc1ccc(cc1C(O)=O)C(F)(F)F)C(F)(F)F