Reaction Details
TargetReverse transcriptase/RNaseH
LigandBDBM50071760
Substrate/Competitorn/a
Meas. Tech.ChEMBL_197451 (CHEMBL804236)
IC50 15000±n/a nM
Citation Milton, JSlater, MJBird, AJSpinks, DScott, GPrice, CEDowning, SGreen, DVMadar, SBethell, RStammers, DK Biaryl acids: novel non-nucleoside inhibitors of HIV reverse transcriptase types 1 and 2. Bioorg Med Chem Lett8:2623-8 (1999) Reverse transcriptase/RNaseH
Name:Reverse transcriptase/RNaseH
Type:PROTEIN
Mol. Mass.:65229.15
Organism:Human immunodeficiency virus 1
Description:ChEMBL_1473730
Residue:566
BDBM50071760
NameBDBM50071760
Synonyms:5-bromo-2-{[(3-{[(4-bromo-2-carboxyphenyl)amino]carbonyl}phenyl)acetyl]amino}benzoic acid | CHEMBL88458
TypeSmall organic molecule
Emp. Form.C23H16Br2N2O6
Mol. Mass.576.191
SMILESOC(=O)c1cc(Br)ccc1NC(=O)Cc1cccc(c1)C(=O)Nc1ccc(Br)cc1C(O)=O