Reaction Details
TargetReverse transcriptase/RNaseH
LigandBDBM50071777
Substrate/Competitorn/a
Meas. Tech.ChEMBL_196364 (CHEMBL805997)
IC50 1700±n/a nM
Citation Milton, JSlater, MJBird, AJSpinks, DScott, GPrice, CEDowning, SGreen, DVMadar, SBethell, RStammers, DK Biaryl acids: novel non-nucleoside inhibitors of HIV reverse transcriptase types 1 and 2. Bioorg Med Chem Lett8:2623-8 (1999) Reverse transcriptase/RNaseH
Name:Reverse transcriptase/RNaseH
Type:PROTEIN
Mol. Mass.:65229.15
Organism:Human immunodeficiency virus 1
Description:ChEMBL_1473730
Residue:566
BDBM50071777
NameBDBM50071777
Synonyms:5-bromo-2-({6-[(4-bromo-2-carboxyphenyl)amino]-6-oxohexanoyl}amino)benzoic acid | CHEMBL88121
TypeSmall organic molecule
Emp. Form.C20H18Br2N2O6
Mol. Mass.542.175
SMILESOC(=O)c1cc(Br)ccc1NC(=O)CCCCC(=O)Nc1ccc(Br)cc1C(O)=O