Reaction Details
TargetNeutrophil elastase
LigandBDBM50071983
Substrate/Competitorn/a
Meas. Tech.ChEMBL_96776 (CHEMBL705402)
IC50<60±n/a nM
Citation Llinàs-Brunet, MBailey, MDéziel, RFazal, GGorys, VGoulet, SHalmos, TMaurice, RPoirier, MPoupart, MARancourt, JThibeault, DWernic, DLamarre, D Studies on the C-terminal of hexapeptide inhibitors of the hepatitis C virus serine protease. Bioorg Med Chem Lett8:2719-24 (1999) Neutrophil elastase
Name:Neutrophil elastase
Type:Enzyme
Mol. Mass.:28532.38
Organism:Homo sapiens (Human)
Description:P08246
Residue:267
BDBM50071983
NameBDBM50071983
Synonyms:(S)-3-((S)-2-Acetylamino-3-carboxy-propionylamino)-N-[(1S,2S)-2-methyl-1-((S)-2-methyl-1-{2-[(S)-1-(2,2,2-trifluoro-acetyl)-butylcarbamoyl]-pyrrolidine-1-carbonyl}-propylcarbamoyl)-butyl]-succinamic acid | CHEMBL310738
TypeSmall organic molecule
Emp. Form.C32H49F3N6O11
Mol. Mass.750.7603
SMILESCCC[C@H](NC(=O)[C@@H]1CCCN1C(=O)[C@@H](NC(=O)[C@@H](NC(=O)[C@@H](CC(O)=O)NC(=O)[C@H](CC(O)=O)NC(C)=O)[C@@H](C)CC)C(C)C)C(=O)C(F)(F)F