Reaction Details
TargetGenome polyprotein/Non-structural protein 4A
LigandBDBM50071974
Substrate/Competitorn/a
Meas. Tech.ChEMBL_143630 (CHEMBL752791)
IC50 28000±n/a nM
Citation Llinàs-Brunet, MBailey, MDéziel, RFazal, GGorys, VGoulet, SHalmos, TMaurice, RPoirier, MPoupart, MARancourt, JThibeault, DWernic, DLamarre, D Studies on the C-terminal of hexapeptide inhibitors of the hepatitis C virus serine protease. Bioorg Med Chem Lett8:2719-24 (1999) Genome polyprotein/Non-structural protein 4A
Name:Genome polyprotein/Non-structural protein 4A
Synonyms:Hepatitis C virus serine protease, NS3/NS4A
Type:n/a
Mol. Mass.:n/a
Description:ASSAY_ID of ChEMBL is 1969955
Components:This complex has 2 components.
Component 1
Name:Non-structural protein 4A
Type:PROTEIN
Mol. Mass.:5762.65
Organism:Hepatitis C virus
Description:ChEMBL_305334
Residue:54
Component 2
Name:Genome polyprotein
Synonyms:Hepatitis C virus NS3 protease/helicase | Hepatitis C virus serine protease, NS3/NS4A
Type:Protein
Mol. Mass.:67067.41
Organism:Hepatitis C virus
Description:A3EZI9
Residue:631
BDBM50071974
NameBDBM50071974
Synonyms:(S)-3-((S)-2-Acetylamino-3-carboxy-propionylamino)-N-((1S,2S)-1-{(S)-1-[2-((R)-1-carboxy-2-mercapto-ethylcarbamoyl)-pyrrolidine-1-carbonyl]-2-methyl-propylcarbamoyl}-2-methyl-butyl)-succinamic acid NS5A-NS5B
TypeSmall organic molecule
Emp. Form.C29H46N6O12S
Mol. Mass.702.774
SMILESCC[C@H](C)[C@H](NC(=O)[C@H](CC(O)=O)NC(=O)[C@H](CC(O)=O)NC(C)=O)C(=O)N[C@@H](C(C)C)C(=O)N1CCC[C@H]1C(=O)N[C@@H](CS)C(O)=O