Reaction Details
TargetProthrombin
LigandBDBM50072531
Substrate/Competitorn/a
Meas. Tech.ChEMBL_225581 (CHEMBL847937)
Ki 75±n/a nM
Citation St-Denis, YAugelli-Szafran, CEBachand, BBerryman, KADiMaio, JDoherty, AMEdmunds, JJLeblond, LLévesque, SNarasimhan, LSPenvose-Yi, JRRubin, JRTarazi, MWinocour, PDSiddiqui, MA Potent bicyclic lactam inhibitors of thrombin: Part I: P3 modifications. Bioorg Med Chem Lett8:3193-8 (1999) Prothrombin
Name:Prothrombin
Type:Protein
Mol. Mass.:70029.57
Organism:Homo sapiens (Human)
Description:P00734
Residue:622
BDBM50072531
NameBDBM50072531
Synonyms:(6S,8aS)-2-[(S)-2-Amino-3-(1H-indol-3-yl)-propionyl]-4-oxo-octahydro-pyrrolo[1,2-a]pyrazine-6-carboxylic acid [4-guanidino-1-(thiazole-2-carbonyl)-butyl]-amide | CHEMBL320781
TypeSmall organic molecule
Emp. Form.C28H35N9O4S
Mol. Mass.593.7
SMILESN[C@@H](Cc1c[nH]c2ccccc12)C(=O)N1C[C@@H]2CC[C@H](N2C(=O)C1)C(=O)NC(CCCNC(N)=N)C(=O)c1nccs1