Reaction Details
TargetProthrombin
LigandBDBM50072522
Substrate/Competitorn/a
Meas. Tech.ChEBML_225581
Ki 84.0±n/a nM
Citation St-Denis, YAugelli-Szafran, CEBachand, BBerryman, KADiMaio, JDoherty, AMEdmunds, JJLeblond, LLévesque, SNarasimhan, LSPenvose-Yi, JRRubin, JRTarazi, MWinocour, PDSiddiqui, MA Potent bicyclic lactam inhibitors of thrombin: Part I: P3 modifications. Bioorg Med Chem Lett8:3193-8 (1999) Prothrombin
Name:Prothrombin
Type:Protein
Mol. Mass.:70029.57
Organism:Homo sapiens (Human)
Description:P00734
Residue:622
BDBM50072522
NameBDBM50072522
Synonyms:(6S,8aS)-2-((S)-2-Hydroxy-2-phenyl-acetyl)-4-oxo-octahydro-pyrrolo[1,2-a]pyrazine-6-carboxylic acid [4-guanidino-1-(thiazole-2-carbonyl)-butyl]-amide | CHEMBL109289
TypeSmall organic molecule
Emp. Form.C25H31N7O5S
Mol. Mass.541.623
SMILESNC(=N)NCCCC(NC(=O)[C@@H]1CC[C@H]2CN(CC(=O)N12)C(=O)[C@@H](O)c1ccccc1)C(=O)c1nccs1