Reaction Details
TargetInsulin receptor
LigandBDBM50385590
Substrate/Competitorn/a
Meas. Tech.ChEMBL_1876852 (CHEMBL4378246)
IC50 597±n/a nM
Citation Kong, XPan, PSun, HXia, HWang, XLi, YHou, T Drug Discovery Targeting Anaplastic Lymphoma Kinase (ALK). J Med Chem62:10927-10954 (2019) 
 
Insulin receptor
Name:Insulin receptor
Type:Receptor Tyrosine Kinase
Mol. Mass.:156322.60
Organism:Homo sapiens (Human)
Description:P06213
Residue:1382
BDBM50385590
NameBDBM50385590
Synonyms:CHEMBL2042829
TypeSmall organic molecule
Emp. Form.C25H29ClN6O3
Mol. Mass.496.989
SMILESCCN1c2ccc(Nc3ncc(Cl)c(N[C@@H]4[C@@H]5C[C@@H](C=C5)[C@@H]4C(N)=O)n3)c(OC)c2CCCC1=O