Reaction Details
TargetALK tyrosine kinase receptor
LigandBDBM50396261
Substrate/Competitorn/a
Meas. Tech.ChEMBL_1876839 (CHEMBL4378233)
IC50 3.0±n/a nM
Citation Kong, XPan, PSun, HXia, HWang, XLi, YHou, T Drug Discovery Targeting Anaplastic Lymphoma Kinase (ALK). J Med Chem62:10927-10954 (2019) 
 
ALK tyrosine kinase receptor
Name:ALK tyrosine kinase receptor
Type:Protein
Mol. Mass.:176453.10
Organism:Homo sapiens (Human)
Description:Q9UM73
Residue:1620
BDBM50396261
NameBDBM50396261
Synonyms:CHEMBL2172323
TypeSmall organic molecule
Emp. Form.C28H34N4O3
Mol. Mass.474.5946
SMILESCOC(=O)[C@H]1CC[C@H](CC1)n1c(NC(=O)c2ccccc2)nc2ccc(CN3CCCCC3)cc12