Reaction Details
TargetCannabinoid receptor 1
LigandBDBM50074318
Substrate/Competitorn/a
Meas. Tech.ChEMBL_46641 (CHEMBL658897)
Ki 76.7±n/a nM
Citation Lan, RLiu, QFan, PLin, SFernando, SRMcCallion, DPertwee, RMakriyannis, A Structure-activity relationships of pyrazole derivatives as cannabinoid receptor antagonists. J Med Chem42:769-76 (1999) 
 
Cannabinoid receptor 1
Name:Cannabinoid receptor 1
Type:G Protein-Coupled Receptor (GPCR)
Mol. Mass.:52856.55
Organism:Rattus norvegicus (rat)
Description:P20272
Residue:473
BDBM50074318
NameBDBM50074318
Synonyms:5-(4-Bromo-phenyl)-1-(2,4-dichloro-phenyl)-4-methyl-1H-pyrazole-3-carboxylic acid cyclohexyl-methyl-amide | CHEMBL285473
TypeSmall organic molecule
Emp. Form.C24H24BrCl2N3O
Mol. Mass.521.277
SMILESCN(C1CCCCC1)C(=O)c1nn(c(c1C)-c1ccc(Br)cc1)-c1ccc(Cl)cc1Cl