Reaction Details
TargetCannabinoid receptor 1
LigandBDBM50074321
Substrate/Competitorn/a
Meas. Tech.ChEMBL_46641 (CHEMBL658897)
Ki 53.9±n/a nM
Citation Lan, RLiu, QFan, PLin, SFernando, SRMcCallion, DPertwee, RMakriyannis, A Structure-activity relationships of pyrazole derivatives as cannabinoid receptor antagonists. J Med Chem42:769-76 (1999) 
 
Cannabinoid receptor 1
Name:Cannabinoid receptor 1
Type:G Protein-Coupled Receptor (GPCR)
Mol. Mass.:52856.55
Organism:Rattus norvegicus (rat)
Description:P20272
Residue:473
BDBM50074321
NameBDBM50074321
Synonyms:5-(4-Bromo-phenyl)-1-(2,4-dichloro-phenyl)-4-methyl-1H-pyrazole-3-carboxylic acid morpholin-4-ylamide | CHEMBL33652
TypeSmall organic molecule
Emp. Form.C21H19BrCl2N4O2
Mol. Mass.510.211
SMILESCc1c(nn(c1-c1ccc(Br)cc1)-c1ccc(Cl)cc1Cl)C(=O)NN1CCOCC1