Reaction Details
TargetCannabinoid receptor 1
LigandBDBM50074315
Substrate/Competitorn/a
Meas. Tech.ChEMBL_46641 (CHEMBL658897)
Ki 346±n/a nM
Citation Lan, RLiu, QFan, PLin, SFernando, SRMcCallion, DPertwee, RMakriyannis, A Structure-activity relationships of pyrazole derivatives as cannabinoid receptor antagonists. J Med Chem42:769-76 (1999) 
 
Cannabinoid receptor 1
Name:Cannabinoid receptor 1
Type:G Protein-Coupled Receptor (GPCR)
Mol. Mass.:52856.55
Organism:Rattus norvegicus (rat)
Description:P20272
Residue:473
BDBM50074315
NameBDBM50074315
Synonyms:5-(2-Amino-phenyl)-1-(2,4-dichloro-phenyl)-4-methyl-1H-pyrazole-3-carboxylic acid piperidin-1-ylamide | CHEMBL424527
TypeSmall organic molecule
Emp. Form.C22H23Cl2N5O
Mol. Mass.444.357
SMILESCc1c(nn(c1-c1ccccc1N)-c1ccc(Cl)cc1Cl)C(=O)NN1CCCCC1