Reaction Details
TargetCannabinoid receptor 2
LigandBDBM50074323
Substrate/Competitorn/a
Meas. Tech.ChEMBL_47004 (CHEMBL657998)
Ki 1310±n/a nM
Citation Lan, RLiu, QFan, PLin, SFernando, SRMcCallion, DPertwee, RMakriyannis, A Structure-activity relationships of pyrazole derivatives as cannabinoid receptor antagonists. J Med Chem42:769-76 (1999) 
 
Cannabinoid receptor 2
Name:Cannabinoid receptor 2
Type:Enzyme Catalytic Domain
Mol. Mass.:38220.43
Organism:MOUSE
Description:P47936
Residue:347
BDBM50074323
NameBDBM50074323
Synonyms:5-(4-Bromo-phenyl)-1-(2,4-dichloro-phenyl)-4-methyl-1H-pyrazole-3-carboxylic acid pyrrol-1-ylamide | CHEMBL167661
TypeSmall organic molecule
Emp. Form.C21H15BrCl2N4O
Mol. Mass.490.18
SMILESCc1c(nn(c1-c1ccc(Br)cc1)-c1ccc(Cl)cc1Cl)C(=O)Nn1cccc1