Reaction Details
TargetCannabinoid receptor 1
LigandBDBM50074308
Substrate/Competitorn/a
Meas. Tech.ChEMBL_46641 (CHEMBL658897)
Ki 183±n/a nM
Citation Lan, RLiu, QFan, PLin, SFernando, SRMcCallion, DPertwee, RMakriyannis, A Structure-activity relationships of pyrazole derivatives as cannabinoid receptor antagonists. J Med Chem42:769-76 (1999) 
 
Cannabinoid receptor 1
Name:Cannabinoid receptor 1
Type:G Protein-Coupled Receptor (GPCR)
Mol. Mass.:52856.55
Organism:Rattus norvegicus (rat)
Description:P20272
Residue:473
BDBM50074308
NameBDBM50074308
Synonyms:1-(2,4-Dichloro-phenyl)-5-ethyl-4-methyl-1H-pyrazole-3-carboxylic acid piperidin-1-ylamide | CHEMBL354476
TypeSmall organic molecule
Emp. Form.C18H22Cl2N4O
Mol. Mass.381.299
SMILESCCc1c(C)c(nn1-c1ccc(Cl)cc1Cl)C(=O)NN1CCCCC1