Reaction Details
TargetB2 bradykinin receptor
LigandBDBM50074991
Substrate/Competitorn/a
Meas. Tech.ChEMBL_70880 (CHEMBL684538)
EC50 260±n/a nM
Citation Heitsch, HWagner, ASchölkens, BAWirth, K Novel series of O-substituted 8-quinolines and 4-benzothiazoles as potent antagonists of the bradykinin B2 receptors. Bioorg Med Chem Lett9:327-32 (1999) B2 bradykinin receptor
Name:B2 bradykinin receptor
Type:n/a
Mol. Mass.:42217.03
Organism:Cavia porcellus
Description:n/a
Residue:372
BDBM50074991
NameBDBM50074991
Synonyms:(E)-Penta-2,4-dienoic acid ({[2,4-dichloro-3-(2-methyl-benzothiazol-4-yloxymethyl)-phenyl]-methyl-carbamoyl}-methyl)-amide | CHEMBL113222
TypeSmall organic molecule
Emp. Form.C23H21Cl2N3O3S
Mol. Mass.490.402
SMILESCN(C(=O)CNC(=O)\C=C\C=C)c1ccc(Cl)c(COc2cccc3sc(C)nc23)c1Cl