Reaction Details
TargetAcetylcholine-binding protein
LigandBDBM50520730
Substrate/Competitorn/a
Meas. Tech.ChEMBL_1881879 (CHEMBL4383378)
Ki 22±n/a nM
Citation Yang, XShen, JJiang, LLi, WYu, MPan, GYan, YZhang, CJia, WXiao, LYu, HChen, HZheng, YYu, LXie, QZhou, LShao, L Discovery, cocrystallization and biological evaluation of novel piperidine derivatives as high affinity Ls-AChBP ligands possessing ?7 nAChR activities. Eur J Med Chem160:37-48 (2018) 
 
Acetylcholine-binding protein
Name:Acetylcholine-binding protein
Type:n/a
Mol. Mass.:26055.52
Organism:Lymnaea stagnalis
Description:Soluble acetylcholine receptor
Residue:229
BDBM50520730
NameBDBM50520730
Synonyms:CHEMBL4537587
TypeSmall organic molecule
Emp. Form.C18H20BrClN2O
Mol. Mass.395.721
SMILESClc1cccc(CC2(COc3cncc(Br)c3)CCCNC2)c1