Reaction Details
TargetAcetylcholine-binding protein
LigandBDBM50520732
Substrate/Competitorn/a
Meas. Tech.ChEMBL_1881879 (CHEMBL4383378)
Ki 5.9±n/a nM
Citation Yang, XShen, JJiang, LLi, WYu, MPan, GYan, YZhang, CJia, WXiao, LYu, HChen, HZheng, YYu, LXie, QZhou, LShao, L Discovery, cocrystallization and biological evaluation of novel piperidine derivatives as high affinity Ls-AChBP ligands possessing ?7 nAChR activities. Eur J Med Chem160:37-48 (2018) 
 
Acetylcholine-binding protein
Name:Acetylcholine-binding protein
Type:n/a
Mol. Mass.:26055.52
Organism:Lymnaea stagnalis
Description:Soluble acetylcholine receptor
Residue:229
BDBM50520732
NameBDBM50520732
Synonyms:CHEMBL4444365
TypeSmall organic molecule
Emp. Form.C19H21F3N2O
Mol. Mass.350.378
SMILESFC(F)(F)c1cccc(CC2(COc3cccnc3)CCCNC2)c1