Reaction Details
TargetProstaglandin G/H synthase 1/2
LigandBDBM50076662
Substrate/Competitorn/a
Meas. Tech.ChEMBL_51500 (CHEMBL665835)
IC50 140±n/a nM
Citation Connolly, PJWetter, SKBeers, KNHamel, SCChen, RHWachter, MPAnsell, JSinger, MMSteber, MRitchie, DMArgentieri, DC N-hydroxyurea and hydroxamic acid inhibitors of cyclooxygenase and 5-lipoxygenase. Bioorg Med Chem Lett9:979-84 (1999) Prostaglandin G/H synthase 1/2
Name:Prostaglandin G/H synthase 1/2
Synonyms:Cyclooxygenase
Type:n/a
Mol. Mass.:n/a
Description:ASSAY_ID of ChEMBL is 1666355
Components:This complex has 2 components.
Component 1
Name:Prostaglandin G/H synthase 2
Type:Enzyme Catalytic Domain
Mol. Mass.:69173.51
Organism:RAT
Description:COX-2 0 RAT::P35355
Residue:604
Component 2
Name:Prostaglandin G/H synthase 1
Synonyms:Cox-1 Cyclooxygenase PGH1_RAT Ptgs1
Type:Enzyme Catalytic Domain
Mol. Mass.:69033.56
Organism:RAT
Description:COX-1 0 RAT::Q63921
Residue:602
BDBM50076662
NameBDBM50076662
Synonyms:CHEMBL174684 | methyl 1-methyl-3-[1-(4-methoxyphenyl)-5-(4-methylphenyl)-1H-pyrazol-3-yl]prop-2-ynyl(hydroxy)carbamate
TypeSmall organic molecule
Emp. Form.C23H23N3O4
Mol. Mass.405.4464
SMILESCOC(=O)N(O)C(C)C#Cc1cc(-c2ccc(C)cc2)n(n1)-c1ccc(OC)cc1