Reaction Details
TargetMatrix metalloproteinase-9
LigandBDBM50077158
Substrate/Competitorn/a
Meas. Tech.ChEMBL_105524 (CHEMBL715233)
IC50 210±n/a nM
Citation Kiyama, RTamura, YWatanabe, FTsuzuki, HOhtani, MYodo, M Homology modeling of gelatinase catalytic domains and docking simulations of novel sulfonamide inhibitors. J Med Chem42:1723-38 (1999) 
 
Matrix metalloproteinase-9
Name:Matrix metalloproteinase-9
Type:Enzyme
Mol. Mass.:78452.28
Organism:Homo sapiens (Human)
Description:P14780
Residue:707
BDBM50077158
NameBDBM50077158
Synonyms:(R)-2-[5-(4-Butyl-phenylethynyl)-thiophene-2-sulfonylamino]-3-methyl-butyric acid | CHEMBL50445
TypeSmall organic molecule
Emp. Form.C21H25NO4S2
Mol. Mass.419.558
SMILESCCCCc1ccc(cc1)C#Cc1ccc(s1)S(=O)(=O)N[C@H](C(C)C)C(O)=O