Reaction Details
Target72 kDa type IV collagenase
LigandBDBM50077161
Substrate/Competitorn/a
Meas. Tech.ChEMBL_104552 (CHEMBL718938)
IC50 3.9±n/a nM
Citation Kiyama, RTamura, YWatanabe, FTsuzuki, HOhtani, MYodo, M Homology modeling of gelatinase catalytic domains and docking simulations of novel sulfonamide inhibitors. J Med Chem42:1723-38 (1999) 
 
72 kDa type IV collagenase
Name:72 kDa type IV collagenase
Type:Enzyme
Mol. Mass.:73870.36
Organism:Homo sapiens (Human)
Description: P08253
Residue:660
BDBM50077161
NameBDBM50077161
Synonyms:(R)-2-[5-(4-Butoxy-phenylethynyl)-thiophene-2-sulfonylamino]-3-(1H-indol-3-yl)-propionic acid | CHEMBL49499
TypeSmall organic molecule
Emp. Form.C27H26N2O5S2
Mol. Mass.522.636
SMILESCCCCOc1ccc(cc1)C#Cc1ccc(s1)S(=O)(=O)N[C@H](Cc1c[nH]c2ccccc12)C(O)=O