Reaction Details
TargetGlutamate receptor ionotropic, NMDA 1/2A
LigandBDBM50079387
Substrate/Competitorn/a
Meas. Tech.ChEMBL_143314 (CHEMBL753016)
IC50 100000±n/a nM
Citation Zhou, ZLCai, SXWhittemore, ERKonkoy, CSEspitia, SATran, MRock, DMCoughenour, LLHawkinson, JEBoxer, PABigge, CFWise, LDWeber, EWoodward, RMKeana, JF 4-Hydroxy-1-[2-(4-hydroxyphenoxy)ethyl]-4-(4-methylbenzyl)piperidine: a novel, potent, and selective NR1/2B NMDA receptor antagonist. J Med Chem42:2993-3000 (1999) 
 
Glutamate receptor ionotropic, NMDA 1/2A
Name:Glutamate receptor ionotropic, NMDA 1/2A
Type:n/a
Mol. Mass.:n/a
Description:ASSAY_ID of EBI is 141020
Components:This complex has 2 components.
Component 1
Name:Glutamate receptor ionotropic, NMDA 2A
Synonyms:Glutamate NMDA receptor; Grin1/Grin2a Grin2a NMDE1_RAT
Type:Protein
Mol. Mass.:165478.25
Organism:Rattus norvegicus (Rat)
Description:Q00959
Residue:1464
Component 2
Name:Glutamate receptor ionotropic, NMDA 1
Synonyms:Glutamate (NMDA) receptor subunit zeta 1 Glutamate-NMDA-Channel Glutamate-NMDA-Polyamine NMDA Nmdar1 | phencyclidine
Type:Enzyme Catalytic Domain
Mol. Mass.:105533.40
Organism:RAT
Description:P35439
Residue:938
BDBM50079387
NameBDBM50079387
Synonyms:1-(4-Chloro-phenyl)-2-[4-(4-fluoro-benzyl)-piperidin-1-yl]-ethanol Eliprodil
TypeSmall organic molecule
Emp. Form.C20H23ClFNO
Mol. Mass.347.854
SMILESOC(CN1CCC(Cc2ccc(F)cc2)CC1)c1ccc(Cl)cc1