Reaction Details
TargetGlutamate receptor ionotropic, NMDA 1/2B
LigandBDBM50079387
Substrate/Competitorn/a
Meas. Tech.ChEMBL_143324 (CHEMBL752242)
IC50 1400±n/a nM
Citation Zhou, ZLCai, SXWhittemore, ERKonkoy, CSEspitia, SATran, MRock, DMCoughenour, LLHawkinson, JEBoxer, PABigge, CFWise, LDWeber, EWoodward, RMKeana, JF 4-Hydroxy-1-[2-(4-hydroxyphenoxy)ethyl]-4-(4-methylbenzyl)piperidine: a novel, potent, and selective NR1/2B NMDA receptor antagonist. J Med Chem42:2993-3000 (1999) 
 
Glutamate receptor ionotropic, NMDA 1/2B
Name:Glutamate receptor ionotropic, NMDA 1/2B
Type:n/a
Mol. Mass.:n/a
Description:ASSAY_ID of EBI is 141026
Components:This complex has 2 components.
Component 1
Name:Glutamate receptor ionotropic, NMDA 2B
Synonyms:GluN2B Grin2b NMDA receptor subunit N2B (GluN2B) NMDE2_RAT | NR2B
Type:Protein
Mol. Mass.:166077.66
Organism:Rattus norvegicus (Rat)
Description:Q00960
Residue:1482
Component 2
Name:Glutamate receptor ionotropic, NMDA 1
Synonyms:Glutamate (NMDA) receptor subunit zeta 1 Glutamate-NMDA-Channel Glutamate-NMDA-Polyamine NMDA Nmdar1 | phencyclidine
Type:Enzyme Catalytic Domain
Mol. Mass.:105533.40
Organism:RAT
Description:P35439
Residue:938
BDBM50079387
NameBDBM50079387
Synonyms:1-(4-Chloro-phenyl)-2-[4-(4-fluoro-benzyl)-piperidin-1-yl]-ethanol Eliprodil
TypeSmall organic molecule
Emp. Form.C20H23ClFNO
Mol. Mass.347.854
SMILESOC(CN1CCC(Cc2ccc(F)cc2)CC1)c1ccc(Cl)cc1