Reaction Details
TargetPeroxisome proliferator-activated receptor gamma
LigandBDBM50081224
Substrate/Competitorn/a
Meas. Tech.ChEMBL_154055 (CHEMBL761026)
EC50 1600±n/a nM
Citation Brown, PJWinegar, DAPlunket, KDMoore, LBLewis, MCWilson, JGSundseth, SSKoble, CSWu, ZChapman, JMLehmann, JMKliewer, SAWillson, TM A ureido-thioisobutyric acid (GW9578) is a subtype-selective PPARalpha agonist with potent lipid-lowering activity. J Med Chem42:3785-8 (1999) Peroxisome proliferator-activated receptor gamma
Name:Peroxisome proliferator-activated receptor gamma
Type:Nuclear Receptor
Mol. Mass.:57613.46
Organism:Homo sapiens (Human)
Description:P37231
Residue:505
BDBM50081224
NameBDBM50081224
Synonyms:2-(4-{2-[1-(5-Cyclohexyl-pentyl)-3-(4-fluoro-phenyl)-ureido]-ethyl}-phenoxy)-2-methyl-propionic acid | CHEMBL125230
TypeSmall organic molecule
Emp. Form.C30H41FN2O4
Mol. Mass.512.6559
SMILESCC(C)(Oc1ccc(CCN(CCCCCC2CCCCC2)C(=O)Nc2ccc(F)cc2)cc1)C(O)=O