Reaction Details
TargetPhosphatidylinositol 4,5-bisphosphate 3-kinase catalytic subunit delta isoform
LigandBDBM50527623
Substrate/Competitorn/a
Meas. Tech.ChEMBL_1902919 (CHEMBL4405141)
IC50 0.200000±n/a nM
Citation Thakur, ATawa, GJHenderson, MJDanchik, CLiu, SShah, PWang, AQDunn, GKabir, MPadilha, ECXu, XSimeonov, AKharbanda, SStone, RGrewal, G Design, Synthesis, and Biological Evaluation of Quinazolin-4-one-Based Hydroxamic Acids as Dual PI3K/HDAC Inhibitors. J Med Chem63:4256-4292 (2020) 
 
Phosphatidylinositol 4,5-bisphosphate 3-kinase catalytic subunit delta isoform
Name:Phosphatidylinositol 4,5-bisphosphate 3-kinase catalytic subunit delta isoform
Type:Enzyme Subunit
Mol. Mass.:119489.41
Organism:Homo sapiens (Human)
Description:O00329
Residue:1044
BDBM50527623
NameBDBM50527623
Synonyms:CHEMBL4443378
TypeSmall organic molecule
Emp. Form.C29H32N8O3
Mol. Mass.540.6162
SMILESCC[C@H](Nc1nc(N)nc(C)c1C#N)c1nc2cccc(CCCCCC(=O)NO)c2c(=O)n1-c1ccccc1