Reaction Details
TargetTyrosine-protein kinase Lck
LigandBDBM50083644
Substrate/Competitorn/a
Meas. Tech.ChEBML_221647
IC50 3300±n/a nM
Citation Moffat, DDavis, PHutchings, MDavis, JBerg, DBatchelor, MJohnson, JO'Connell, JMartin, RCrabbe, TDelgado, JPerry, M 4-Pyridin-5-yl-2-(3,4,5-trimethoxyphenylamino)pyrimidines: potent and selective inhibitors of ZAP 70. Bioorg Med Chem Lett9:3351-6 (2000) Tyrosine-protein kinase Lck
Name:Tyrosine-protein kinase Lck
Type:n/a
Mol. Mass.:57987.83
Organism:Homo sapiens (Human)
Description:P06239
Residue:509
BDBM50083644
NameBDBM50083644
Synonyms:CHEMBL322066 | [4-(6-Piperazin-1-yl-pyridin-3-yl)-pyrimidin-2-yl]-(3,4,5-trimethoxy-phenyl)-amine
TypeSmall organic molecule
Emp. Form.C22H26N6O3
Mol. Mass.422.4802
SMILESCOc1cc(Nc2nccc(n2)-c2ccc(nc2)N2CCNCC2)cc(OC)c1OC