Reaction Details
TargetTyrosine-protein kinase CSK
LigandBDBM50083644
Substrate/Competitorn/a
Meas. Tech.ChEBML_52345
IC50>10000±n/a nM
Citation Moffat, DDavis, PHutchings, MDavis, JBerg, DBatchelor, MJohnson, JO'Connell, JMartin, RCrabbe, TDelgado, JPerry, M 4-Pyridin-5-yl-2-(3,4,5-trimethoxyphenylamino)pyrimidines: potent and selective inhibitors of ZAP 70. Bioorg Med Chem Lett9:3351-6 (2000) Tyrosine-protein kinase CSK
Name:Tyrosine-protein kinase CSK
Type:Tyrosine-protein kinase
Mol. Mass.:50707.30
Organism:Homo sapiens (Human)
Description:P41240
Residue:450
BDBM50083644
NameBDBM50083644
Synonyms:CHEMBL322066 | [4-(6-Piperazin-1-yl-pyridin-3-yl)-pyrimidin-2-yl]-(3,4,5-trimethoxy-phenyl)-amine
TypeSmall organic molecule
Emp. Form.C22H26N6O3
Mol. Mass.422.4802
SMILESCOc1cc(Nc2nccc(n2)-c2ccc(nc2)N2CCNCC2)cc(OC)c1OC