Reaction Details
TargetO94806/P05129/P05771/P17252/P24723/P41743/Q02156/Q04759/Q05513/Q05655/Q15139
LigandBDBM50083644
Substrate/Competitorn/a
Meas. Tech.ChEMBL_162549 (CHEMBL768536)
IC50 1300±n/a nM
Citation Moffat, DDavis, PHutchings, MDavis, JBerg, DBatchelor, MJohnson, JO'Connell, JMartin, RCrabbe, TDelgado, JPerry, M 4-Pyridin-5-yl-2-(3,4,5-trimethoxyphenylamino)pyrimidines: potent and selective inhibitors of ZAP 70. Bioorg Med Chem Lett9:3351-6 (2000) O94806/P05129/P05771/P17252/P24723/P41743/Q02156/Q04759/Q05513/Q05655/Q15139
Name:O94806/P05129/P05771/P17252/P24723/P41743/Q02156/Q04759/Q05513/Q05655/Q15139
Synonyms:Protein kinase C (PKC)
Type:n/a
Mol. Mass.:n/a
Description:Combinations of UniProts
Components:This complex has 11 components.
Component 1
Name:Protein kinase C zeta type
Type:Enzyme
Mol. Mass.:67649.13
Organism:Homo sapiens (Human)
Description:n/a
Residue:592
Component 2
Name:Protein kinase C theta type
Synonyms:KPCT_HUMAN PRKCT Protein kinase C theta type (PRKCQ) nPKC-theta
Type:Serine/threonine-protein kinase
Mol. Mass.:81878.04
Organism:Homo sapiens (Human)
Description:Full-length human PKC theta (Panvera Catalog No. P2996).
Residue:706
Component 3
Name:Protein kinase C epsilon type
Synonyms:KPCE_HUMAN PKCE Protein kinase C epsilon Protein kinase C, PKC; classical/novel nPKC-epsilon
Type:Enzyme
Mol. Mass.:83680.45
Organism:Homo sapiens (Human)
Description:The recombinant human PKC enzymes were produced using a baculovirus expression system in SF9 cells
Residue:737
Component 4
Name:Serine/threonine-protein kinase D3
Synonyms:EPK2 PRKCN Protein kinase C nu Protein kinase C, PKC Protein kinase EPK2 classical/novel | nPKC-nu
Type:Enzyme Catalytic Domain
Mol. Mass.:100475.64
Organism:Homo sapiens (Human)
Description:gi_5031689
Residue:890
Component 5
Name:Protein kinase C alpha type
Synonyms:KPCA_HUMAN PKC alpha and beta-2 PKC-alpha PRKACA Protein Kinase C- alpha Protein kinase C alpha (PKCa) Protein kinase C alpha type (PRKCA) RAF proto-oncogene serine/threonine-protein kinase
Type:Enzyme
Mol. Mass.:76755.65
Organism:Homo sapiens (Human)
Description:The recombinant human PKC enzymes were produced using a baculovirus expression system in SF9 cells
Residue:672
Component 6
Name:Protein kinase C delta type
Synonyms:KPCD_HUMAN PKCD Protein Kinase C- delta nPKC-delta
Type:Enzyme
Mol. Mass.:77516.79
Organism:Homo sapiens (Human)
Description:The recombinant human PKC enzymes were produced using a baculovirus expression system in SF9 cells
Residue:676
Component 7
Name:Protein kinase C gamma type
Synonyms:KPCG_HUMAN PKC-gamma PRKCG Protein kinase C gamma type Protein kinase C, gamma
Type:Enzyme
Mol. Mass.:78458.05
Organism:Homo sapiens (Human)
Description:The recombinant human PKC enzymes were produced using a baculovirus expression system in SF9 cells
Residue:697
Component 8
Name:Protein kinase C beta type
Synonyms:KPCB_HUMAN PKC beta PKCB PRKCB1 Protein kinase C beta type | Protein kinase C beta type II (PRKCB2)
Type:Enzyme
Mol. Mass.:76873.67
Organism:Homo sapiens (Human)
Description:The recombinant human PKC enzymes were produced using a baculovirus expression system in SF9 cells
Residue:671
Component 9
Name:Protein kinase C eta type
Synonyms:KPCL_HUMAN PKCL PRKCL Protein kinase C, PKC; classical/novel | nPKC-eta
Type:Enzyme
Mol. Mass.:77844.26
Organism:Homo sapiens (Human)
Description:The recombinant human PKC enzymes were produced using a baculovirus expression system in SF9 cells
Residue:683
Component 10
Name:Protein kinase C iota type
Synonyms:Atypical protein kinase C-lambda/iota KPCI_HUMAN PRKCI Protein kinase C iota Protein kinase C iota type aPKC-lambda/iota | nPKC-iota
Type:Enzyme
Mol. Mass.:68251.56
Organism:Homo sapiens (Human)
Description:P41743
Residue:596
Component 11
Name:Serine/threonine-protein kinase D1
Synonyms:KPCD1_HUMAN PKD1 PRKD1 Protein kinase C mu type Protein kinase C, PKC; classical/novel Protein kinase D (PRKD1) nPKC-D1 | nPKC-mu
Type:Serine/threonine-protein kinase
Mol. Mass.:101705.07
Organism:Homo sapiens (Human)
Description:gi_115529463
Residue:912
BDBM50083644
NameBDBM50083644
Synonyms:CHEMBL322066 | [4-(6-Piperazin-1-yl-pyridin-3-yl)-pyrimidin-2-yl]-(3,4,5-trimethoxy-phenyl)-amine
TypeSmall organic molecule
Emp. Form.C22H26N6O3
Mol. Mass.422.4802
SMILESCOc1cc(Nc2nccc(n2)-c2ccc(nc2)N2CCNCC2)cc(OC)c1OC