Reaction Details
TargetAcetyl-CoA carboxylase 1
LigandBDBM50529224
Substrate/Competitorn/a
Meas. Tech.ChEMBL_1908109 (CHEMBL4410467)
IC50 2.1±n/a nM
Citation Mizojiri, RAsano, MSasaki, MSatoh, YYamamoto, YSumi, HMaezaki, H The identification and pharmacological evaluation of potent, selective and orally available ACC1 inhibitor. Bioorg Med Chem Lett29:0 (2019) 
 
Acetyl-CoA carboxylase 1
Name:Acetyl-CoA carboxylase 1
Type:Protein
Mol. Mass.:265543.22
Organism:Homo sapiens (Human)
Description:Q13085
Residue:2346
BDBM50529224
NameBDBM50529224
Synonyms:CHEMBL4435891
TypeSmall organic molecule
Emp. Form.C27H28N4O4
Mol. Mass.472.5356
SMILESCC(NC(=O)N(C)C)c1ccc2nc(oc2c1)-c1ccc(Oc2cccc(OCC3CC3)c2)nc1