Reaction Details
TargetShort transient receptor potential channel 5
LigandBDBM50529447
Substrate/Competitorn/a
Meas. Tech.ChEMBL_1908620 (CHEMBL4410978)
IC50 530±n/a nM
Citation Yu, MLedeboer, MWDaniels, MMalojcic, GTibbitts, TTCoeffet-Le Gal, MPan-Zhou, XRWesterling-Bui, ABeconi, MReilly, JFMundel, PHarmange, JC Discovery of a Potent and Selective TRPC5 Inhibitor, Efficacious in a Focal Segmental Glomerulosclerosis Model. ACS Med Chem Lett10:1579-1585 (2019) 
 
Short transient receptor potential channel 5
Name:Short transient receptor potential channel 5
Type:Enzyme
Mol. Mass.:111421.47
Organism:Homo sapiens (Human)
Description:Q9UL62
Residue:973
BDBM50529447
NameBDBM50529447
Synonyms:CHEMBL4517031
TypeSmall organic molecule
Emp. Form.C16H23ClN4O2
Mol. Mass.338.832
SMILESC[C@H]1CC[C@H](CN2CCN(CC2=O)c2cn[nH]c(=O)c2Cl)CC1