Reaction Details
TargetShort transient receptor potential channel 5
LigandBDBM50529421
Substrate/Competitorn/a
Meas. Tech.ChEMBL_1908620 (CHEMBL4410978)
IC50 180±n/a nM
Citation Yu, MLedeboer, MWDaniels, MMalojcic, GTibbitts, TTCoeffet-Le Gal, MPan-Zhou, XRWesterling-Bui, ABeconi, MReilly, JFMundel, PHarmange, JC Discovery of a Potent and Selective TRPC5 Inhibitor, Efficacious in a Focal Segmental Glomerulosclerosis Model. ACS Med Chem Lett10:1579-1585 (2019) 
 
Short transient receptor potential channel 5
Name:Short transient receptor potential channel 5
Type:Enzyme
Mol. Mass.:111421.47
Organism:Homo sapiens (Human)
Description:Q9UL62
Residue:973
BDBM50529421
NameBDBM50529421
Synonyms:CHEMBL4530872
TypeSmall organic molecule
Emp. Form.C16H14ClF3N4O2
Mol. Mass.386.756
SMILESFC(F)(F)c1ccccc1CN1CCN(CC1=O)c1cn[nH]c(=O)c1Cl