Reaction Details
Target2-5A-dependent ribonuclease
LigandBDBM50085558
Substrate/Competitorn/a
Meas. Tech.ChEMBL_195097 (CHEMBL795209)
IC50 2.6±n/a nM
Citation Kitade, YWakana, MTsuboi, TYatome, CBayly, SFPlayer, MRTorrence, PF 2-Methyladenosine-Substituted 2',5'-oligoadenylates: conformations, 2-5A binding and catalytic activities with human ribonuclease L. Bioorg Med Chem Lett10:329-31 (2000) 2-5A-dependent ribonuclease
Name:2-5A-dependent ribonuclease
Type:PROTEIN
Mol. Mass.:83534.35
Organism:Homo sapiens (Human)
Description:ChEMBL_164152
Residue:741
BDBM50085558
NameBDBM50085558
Synonyms:CHEMBL402676 | Oligoadenylate analogue
TypeSmall organic molecule
Emp. Form.C31H40N15O19P3
Mol. Mass.1019.6597
SMILESCc1nc(N)c2ncn([C@@H]3O[C@H](COP(O)(=O)O[C@@H]4[C@H](O)[C@@H](COP(O)(=O)O[C@@H]5[C@H](O)[C@@H](COP(O)(O)=O)O[C@H]5n5cnc6c(N)ncnc56)O[C@H]4n4cnc5c(N)ncnc45)[C@@H](O)[C@H]3O)c2n1