Reaction Details
TargetEpidermal growth factor receptor
LigandBDBM50029668
Substrate/Competitorn/a
Meas. Tech.ChEMBL_1913526 (CHEMBL4416109)
IC50 0.421000±n/a nM
Citation Lin, SYChang Hsu, YPeng, YHKe, YYLin, WHSun, HYShiao, HYKuo, FMChen, PYLien, TWChen, CHChu, CYWang, SYYeh, KCChen, CPHsu, TAWu, SYYeh, TKChen, CTHsieh, HP Discovery of a Furanopyrimidine-Based Epidermal Growth Factor Receptor Inhibitor (DBPR112) as a Clinical Candidate for the Treatment of Non-Small Cell Lung Cancer. J Med Chem62:10108-10123 (2019) 
 
Epidermal growth factor receptor
Name:Epidermal growth factor receptor
Type:Receptor Kinase Domain
Mol. Mass.:134279.59
Organism:Homo sapiens (Human)
Description:P00533
Residue:1210
BDBM50029668
NameBDBM50029668
Synonyms:AZD-9291 US10085983, Compound AZD-9291 US11111233, Example AZD9291 US20230322822, Compound AZD9291 WO2022090481, Example osimertinib
TypeSmall organic molecule
Emp. Form.C28H33N7O2
Mol. Mass.499.6073
SMILESCOc1cc(N(C)CCN(C)C)c(NC(=O)C=C)cc1Nc1nccc(n1)-c1cn(C)c2ccccc12