Reaction Details
TargetReceptor-type tyrosine-protein phosphatase F
LigandBDBM50409191
Substrate/Competitorn/a
Meas. Tech.ChEMBL_97146 (CHEMBL711894)
IC50 3250±n/a nM
Citation Malamas, MSSredy, JMoxham, CKatz, AXu, WMcDevitt, RAdebayo, FOSawicki, DRSeestaller, LSullivan, DTaylor, JR Novel benzofuran and benzothiophene biphenyls as inhibitors of protein tyrosine phosphatase 1B with antihyperglycemic properties. J Med Chem43:1293-310 (2001) Receptor-type tyrosine-protein phosphatase F
Name:Receptor-type tyrosine-protein phosphatase F
Type:Protein
Mol. Mass.:212869.85
Organism:Homo sapiens (Human)
Description:P10586
Residue:1907
BDBM50409191
NameBDBM50409191
Synonyms:CHEMBL365490
TypeSmall organic molecule
Emp. Form.C36H28O4
Mol. Mass.524.6051
SMILESOC(=O)[C@H](Cc1ccccc1)Oc1ccc(cc1)-c1ccc(cc1)-c1c(Cc2ccccc2)oc2ccccc12