Reaction Details
TargetC-C chemokine receptor type 5
LigandBDBM50088315
Substrate/Competitorn/a
Meas. Tech.ChEMBL_39630 (CHEMBL649937)
IC50 6.8±n/a nM
Citation Shiraishi, MAramaki, YSeto, MImoto, HNishikawa, YKanzaki, NOkamoto, MSawada, HNishimura, OBaba, MFujino, M Discovery of novel, potent, and selective small-molecule CCR5 antagonists as anti-HIV-1 agents: synthesis and biological evaluation of anilide derivatives with a quaternary ammonium moiety. J Med Chem43:2049-63 (2000) C-C chemokine receptor type 5
Name:C-C chemokine receptor type 5
Type:Enzyme
Mol. Mass.:40540.21
Organism:Homo sapiens (Human)
Description:P51681
Residue:352
BDBM50088315
NameBDBM50088315
Synonyms:(3-Hydroxy-propyl)-dimethyl-{4-[(7-p-tolyl-2,3-dihydro-benzo[b]oxepine-4-carbonyl)-amino]-benzyl}-ammonium; iodide | CHEMBL294501
TypeSmall organic molecule
Emp. Form.C30H35N2O3
Mol. Mass.471.61
SMILESCc1ccc(cc1)-c1ccc2OCCC(=Cc2c1)C(=O)Nc1ccc(C[N+](C)(C)CCCO)cc1