Reaction Details
TargetMast/stem cell growth factor receptor Kit
LigandBDBM50533694
Substrate/Competitorn/a
Meas. Tech.ChEMBL_1926536 (CHEMBL4429608)
EC50<100±n/a nM
Citation Li, BWang, ALiu, JQi, ZLiu, XYu, KWu, HChen, CHu, CWang, WWu, JHu, ZYe, LZou, FLiu, FWang, BWang, LRen, TZhang, SBai, MZhang, SLiu, JLiu, Q Discovery of N-((1-(4-(3-(3-((6,7-Dimethoxyquinolin-3-yl)oxy)phenyl)ureido)-2-(trifluoromethyl)phenyl)piperidin-4-yl)methyl)propionamide (CHMFL-KIT-8140) as a Highly Potent Type II Inhibitor Capable of Inhibiting the T670I "Gatekeeper" Mutant of cKIT Kinase. J Med Chem59:8456-72 (2016) 
 
Mast/stem cell growth factor receptor Kit
Name:Mast/stem cell growth factor receptor Kit
Type:Protein
Mol. Mass.:109869.37
Organism:Homo sapiens (Human)
Description:P10721
Residue:976
BDBM50533694
NameBDBM50533694
Synonyms:CHEMBL4445808
TypeSmall organic molecule
Emp. Form.C34H36F3N5O5
Mol. Mass.651.6753
SMILESCCC(=O)NCC1CCN(CC1)c1ccc(NC(=O)Nc2cccc(Oc3ccnc4cc(OC)c(OC)cc34)c2)cc1C(F)(F)F