Reaction Details
TargetChitin synthase 1
LigandBDBM50089556
Substrate/Competitorn/a
Meas. Tech.ChEBML_49240
IC50 54±n/a nM
Citation Masubuchi, KTaniguchi, MUmeda, IHattori, KSuda, HKohchi, YIsshiki, YSakai, TKohchi, MShirai, MOkabe, HSudoh, MYamazaki, TShimma, N Synthesis and structure-activity relationships of novel fungal chitin synthase inhibitors. Bioorg Med Chem Lett10:1459-62 (2000) Chitin synthase 1
Name:Chitin synthase 1
Type:PROTEIN
Mol. Mass.:88249.31
Organism:Candida albicans
Description:ChEMBL_49240
Residue:776
BDBM50089556
NameBDBM50089556
Synonyms:5-[Benzyl-((E)-6,6-dimethyl-hept-2-en-4-ynyl)-amino]-3,4-dihydro-1H-quinolin-2-one | CHEMBL287110
TypeSmall organic molecule
Emp. Form.C25H28N2O
Mol. Mass.372.5026
SMILESCC(C)(C)C#C\C=C\CN(Cc1ccccc1)c1cccc2NC(=O)CCc12