Reaction Details
TargetChitin synthase 1
LigandBDBM50089558
Substrate/Competitorn/a
Meas. Tech.ChEBML_49240
IC50 213±n/a nM
Citation Masubuchi, KTaniguchi, MUmeda, IHattori, KSuda, HKohchi, YIsshiki, YSakai, TKohchi, MShirai, MOkabe, HSudoh, MYamazaki, TShimma, N Synthesis and structure-activity relationships of novel fungal chitin synthase inhibitors. Bioorg Med Chem Lett10:1459-62 (2000) Chitin synthase 1
Name:Chitin synthase 1
Type:PROTEIN
Mol. Mass.:88249.31
Organism:Candida albicans
Description:ChEMBL_49240
Residue:776
BDBM50089558
NameBDBM50089558
Synonyms:5-[(6-Hydroxy-6-methyl-hepta-2,4-diynyl)-methyl-amino]-3,4-dihydro-1H-quinolin-2-one | CHEMBL285445
TypeSmall organic molecule
Emp. Form.C18H20N2O2
Mol. Mass.296.3636
SMILESCN(CC#CC#CC(C)(C)O)c1cccc2NC(=O)CCc12