Reaction Details
TargetChitin synthase 1
LigandBDBM50089561
Substrate/Competitorn/a
Meas. Tech.ChEBML_49240
IC50 13±n/a nM
Citation Masubuchi, KTaniguchi, MUmeda, IHattori, KSuda, HKohchi, YIsshiki, YSakai, TKohchi, MShirai, MOkabe, HSudoh, MYamazaki, TShimma, N Synthesis and structure-activity relationships of novel fungal chitin synthase inhibitors. Bioorg Med Chem Lett10:1459-62 (2000) Chitin synthase 1
Name:Chitin synthase 1
Type:PROTEIN
Mol. Mass.:88249.31
Organism:Candida albicans
Description:ChEMBL_49240
Residue:776
BDBM50089561
NameBDBM50089561
Synonyms:5-[((Z)-6,6-Dimethyl-hept-2-en-4-ynyl)-methyl-amino]-3,4-dihydro-1H-quinolin-2-one | CHEMBL412808
TypeSmall organic molecule
Emp. Form.C19H24N2O
Mol. Mass.296.4067
SMILESCN(C\C=C/C#CC(C)(C)C)c1cccc2NC(=O)CCc12