Reaction Details
TargetProthrombin
LigandBDBM50090247
Substrate/Competitorn/a
Meas. Tech.ChEBML_208895
Ki 34±n/a nM
Citation Hayler, JKane, PDLeGrand, DLugrin, FMenear, KPrice, RAllen, MCockcroft, XAmbler, JButler, KDunnet, KMitchelson, ATalbot, MTweed, MWills, N The design and synthesis of thrombin inhibitors: the introduction of in vivo efficacy and oral bioavailability into benzthiazolylalanine inhibitors. Bioorg Med Chem Lett10:1567-70 (2000) Prothrombin
Name:Prothrombin
Type:Protein
Mol. Mass.:70029.57
Organism:Homo sapiens (Human)
Description:P00734
Residue:622
BDBM50090247
NameBDBM50090247
Synonyms:6-[3-(4-Acetyl-piperazin-1-yl)-3-oxo-propyl]-3,3-dimethyl-1,2,3,4-tetrahydro-quinoline-8-sulfonic acid {(S)-1-benzothiazol-2-ylmethyl-2-[4-(2-fluoro-ethyl)-piperidin-1-yl]-2-oxo-ethyl}-amide | CHEMBL287715
TypeSmall organic molecule
Emp. Form.C37H49FN6O5S2
Mol. Mass.740.951
SMILESCC(=O)N1CCN(CC1)C(=O)CCc1cc2CC(C)(C)CNc2c(c1)S(=O)(=O)N[C@@H](Cc1nc2ccccc2s1)C(=O)N1CCC(CCF)CC1