Reaction Details
TargetProthrombin
LigandBDBM50090249
Substrate/Competitorn/a
Meas. Tech.ChEBML_208895
Ki 6±n/a nM
Citation Hayler, JKane, PDLeGrand, DLugrin, FMenear, KPrice, RAllen, MCockcroft, XAmbler, JButler, KDunnet, KMitchelson, ATalbot, MTweed, MWills, N The design and synthesis of thrombin inhibitors: the introduction of in vivo efficacy and oral bioavailability into benzthiazolylalanine inhibitors. Bioorg Med Chem Lett10:1567-70 (2000) Prothrombin
Name:Prothrombin
Type:Protein
Mol. Mass.:70029.57
Organism:Homo sapiens (Human)
Description:P00734
Residue:622
BDBM50090249
NameBDBM50090249
Synonyms:3,3-Dimethyl-1,2,3,4-tetrahydro-quinoline-8-sulfonic acid {(S)-1-[4-(2-fluoro-ethyl)-piperidine-1-carbonyl]-4-guanidino-butyl}-amide | CHEMBL416600
TypeSmall organic molecule
Emp. Form.C24H39FN6O3S
Mol. Mass.510.668
SMILESCC1(C)CNc2c(C1)cccc2S(=O)(=O)N[C@@H](CCCNC(N)=N)C(=O)N1CCC(CCF)CC1