Reaction Details
TargetHistone-lysine N-methyltransferase, H3 lysine-79 specific
LigandBDBM50535041
Substrate/Competitorn/a
Meas. Tech.ChEMBL_1929626 (CHEMBL4432802)
Kd 50000±n/a nM
Citation Scheufler, CMöbitz, HGaul, CRagot, CBe, CFernández, CBeyer, KSTiedt, RStauffer, F Optimization of a Fragment-Based Screening Hit toward Potent DOT1L Inhibitors Interacting in an Induced Binding Pocket. ACS Med Chem Lett7:730-4 (2016) 
 
Histone-lysine N-methyltransferase, H3 lysine-79 specific
Name:Histone-lysine N-methyltransferase, H3 lysine-79 specific
Type:Protein
Mol. Mass.:184911.91
Organism:Homo sapiens (Human)
Description:Q8TEK3
Residue:1537
BDBM50535041
NameBDBM50535041
Synonyms:CHEMBL1312860
TypeSmall organic molecule
Emp. Form.C13H10Cl2N2O2
Mol. Mass.297.137
SMILESCNC(=O)c1cc(c[nH]1)C(=O)c1c(Cl)cccc1Cl