Reaction Details
TargetPeroxisome proliferator-activated receptor delta
LigandBDBM50085041
Substrate/Competitorn/a
Meas. Tech.ChEMBL_1930562 (CHEMBL4433813)
EC50 210±n/a nM
Citation Giampietro, LLaghezza, ACerchia, CFlorio, RRecinella, LCapone, FAmmazzalorso, ABruno, IDe Filippis, BFantacuzzi, MFerrante, CMaccallini, CTortorella, PVerginelli, FBrunetti, LCama, AAmoroso, RLoiodice, FLavecchia, A Novel Phenyldiazenyl Fibrate Analogues as PPAR ?/?/? Pan-Agonists for the Amelioration of Metabolic Syndrome. ACS Med Chem Lett10:545-551 (2019) 
 
Peroxisome proliferator-activated receptor delta
Name:Peroxisome proliferator-activated receptor delta
Type:Enzyme
Mol. Mass.:49910.45
Organism:Homo sapiens (Human)
Description:Q03181
Residue:441
BDBM50085041
NameBDBM50085041
Synonyms:2-(4-(3-(4-acetyl-3-hydroxy-2-propylphenoxy)propoxy)phenoxy)acetic acid L-165041 {4-[3-(4-Acetyl-3-hydroxy-2-propyl-phenoxy)-propoxy]-phenoxy}-acetic acid(L-165041) | {4-[3-(4-acetyl-3-hydroxy-2-propylphenoxy)propoxy]phenoxy}acetic acid
TypeSmall organic molecule
Emp. Form.C22H26O7
Mol. Mass.402.4376
SMILESCCCc1c(O)c(ccc1OCCCOc1ccc(OCC(O)=O)cc1)C(C)=O