Reaction Details
TargetPeptide deformylase
LigandBDBM50535516
Substrate/Competitorn/a
Meas. Tech.ChEMBL_1930889 (CHEMBL4434140)
Ki 60±n/a nM
Citation Spletstoser, JTDreabit, JKnox, ANBenowitz, ACampobasso, NWard, PCui, GLewandowski, TMcCloskey, LAubart, KM Discovery of piperazic acid peptide deformylase inhibitors with in vivo activity for respiratory tract and skin infections. Bioorg Med Chem Lett29:2410-2414 (2019) 
 
Peptide deformylase
Name:Peptide deformylase
Type:n/a
Mol. Mass.:16901.39
Organism:Escherichia coli
Description:n/a
Residue:150
BDBM50535516
NameBDBM50535516
Synonyms:CHEMBL4542964
TypeSmall organic molecule
Emp. Form.C20H35N3O5
Mol. Mass.397.509
SMILESCCC(=O)[C@@H](NC(=O)[C@@H]1CCCNN1C(=O)[C@H](CC(C)C)CC(O)=O)C(C)C