Reaction Details
TargetDelta-type opioid receptor
LigandBDBM50092678
Substrate/Competitorn/a
Meas. Tech.ChEMBL_145322 (CHEMBL750410)
IC50 175±n/a nM
Citation Plobeck, NDelorme, DWei, ZYYang, HZhou, FSchwarz, PGawell, LGagnon, HPelcman, BSchmidt, RYue, SYWalpole, CBrown, WZhou, ELabarre, MPayza, KSt-Onge, SKamassah, AMorin, PEProjean, DDucharme, JRoberts, E New diarylmethylpiperazines as potent and selective nonpeptidic delta opioid receptor agonists with increased In vitro metabolic stability. J Med Chem43:3878-94 (2000) Delta-type opioid receptor
Name:Delta-type opioid receptor
Type:G Protein-Coupled Receptor (GPCR)
Mol. Mass.:40382.98
Organism:Homo sapiens (Human)
Description:Competition binding assays were carried out using membrane preparations from transfected HN9.10 cells that constitutively expressed the delta opioid receptor.
Residue:372
BDBM50092678
NameBDBM50092678
Synonyms:CHEMBL125741 | N-Ethyl-4-(phenyl-piperazin-1-yl-methyl)-benzamide
TypeSmall organic molecule
Emp. Form.C20H25N3O
Mol. Mass.323.432
SMILESCCNC(=O)c1ccc(cc1)C(N1CCNCC1)c1ccccc1